{"text_format":"1","workbook":"xlsx","n_sheets":7,"sheets":["Instructions","Previous Count","Product info","Count","Deliveries and sales","Liquor Cost","Liquor cost trend"],"not_rendered":{"charts":5,"images":6,"macros":1,"external_links":0,"defined_names":0,"comments":0,"pivot_tables":0},"unopened":[],"bounds":{"document_bytes":16777216,"sheet_cells":100000,"rows_first":2000,"rows_last":500,"rows_between":2000,"halvings":0,"cell_chars":16384,"cell_head_chars":4096},"cells_cut":0,"cells_raw":0,"read":"whole","date_system":"1900"}

{"sheet":"Instructions","index":0,"n_rows":10,"n_cols":2,"rows_kept":10,"cut":false,"hidden":false,"merged":[[9,1,9,7]]}
[]
[]
[]
[]
[]
[]
[]
[]
[null,"To watch a detailed instructional video which shows you how to use this free liquor inventory spreadsheet, click the link below: "]
[null,"http://bar-i.com/bar-i-free-liquor-inventory-spreadsheet-instructions"]

{"sheet":"Previous Count","index":1,"n_rows":502,"n_cols":16,"rows_kept":502,"cut":false,"hidden":false,"merged":[]}
[null,null,null,null,"Zone 1","Zone 2","Zone 3","Zone 4","Zone 5","Zone 6","Zone 7","Zone 8","Zone 9","Zone 10","Total","Value"]
[null,null,null,null,"e.g. Well 1","e.g. Well 2","e.g. Bar cooler","e.g. Bar liquor pyramid","e.g. Bar Liquor","e.g.Liquor backups","e.g. Dry storage","e.g. Liquor store","e.g. Walk in cooler","e.g. Wine room",0,0]
[null,1,null,null,null,null,null,null,null,null,null,null,null,null,0,0]
[null,2,null,null,null,null,null,null,null,null,null,null,null,null,0,0]
[null,3,null,null,null,null,null,null,null,null,null,null,null,null,0,0]
[null,4,null,null,null,null,null,null,null,null,null,null,null,null,0,0]
[null,5,null,null,null,null,null,null,null,null,null,null,null,null,0,0]
[null,6,null,null,null,null,null,null,null,null,null,null,null,null,0,0]
[null,7,null,null,null,null,null,null,null,null,null,null,null,null,0,0]
[null,8,null,null,null,null,null,null,null,null,null,null,null,null,0,0]
[null,9,null,null,null,null,null,null,null,null,null,null,null,null,0,0]
[null,10,null,null,null,null,null,null,null,null,null,null,null,null,0,0]
[null,11,null,null,null,null,null,null,null,null,null,null,null,null,0,0]
[null,12,null,null,null,null,null,null,null,null,null,null,null,null,0,0]
[null,13,null,null,null,null,null,null,null,null,null,null,null,null,0,0]
[null,14,null,null,null,null,null,null,null,null,null,null,null,null,0,0]
[null,15,null,null,null,null,null,null,null,null,null,null,null,null,0,0]
[null,16,null,null,null,null,null,null,null,null,null,null,null,null,0,0]
[null,17,null,null,null,null,null,null,null,null,null,null,null,null,0,0]
[null,18,null,null,null,null,null,null,null,null,null,null,null,null,0,0]
[null,19,null,null,null,null,null,null,null,null,null,null,null,null,0,0]
[null,20,null,null,null,null,null,null,null,null,null,null,null,null,0,0]
[null,21,null,null,null,null,null,null,null,null,null,null,null,null,0,0]
[null,22,null,null,null,null,null,null,null,null,null,null,null,null,0,0]
[null,23,null,null,null,null,null,null,null,null,null,null,null,null,0,0]
[null,24,null,null,null,null,null,null,null,null,null,null,null,null,0,0]
[null,25,null,null,null,null,null,null,null,null,null,null,null,null,0,0]
[null,26,null,null,null,null,null,null,null,null,null,null,null,null,0,0]
[null,27,null,null,null,null,null,null,null,null,null,null,null,null,0,0]
[null,28,null,null,null,null,null,null,null,null,null,null,null,null,0,0]
{"$rows_left_out":473}
{"sheet":"Product info","index":2,"n_rows":502,"n_cols":32,"rows_kept":502,"cut":false,"hidden":false,"merged":[]}
[null,null,null,null,null,"www.bar-i.com"]
[null,"#","Enter product name","Category","Price ($)","Per how many? ",null,null,null,null,null,null,null,null,null,null,null,null,null,null,null,null,null,null,null,null,"Categories","Purchase unit","Purchase unit (long)",null,null,"Line item quantity"]
[null,1,"Bottle Bud","Bottle/ can beer",19,"24/ case of twenty four (e.g. 24 pack of cans)",null,null,null,null,null,null,null,null,null,null,null,null,null,null,null,null,null,null,null,null,"Draft beer",1,"1 / single item (e.g. single keg or bottle)",null,null,{"$f":"INDEX($AB$3:$AB$9,MATCH(F3,$AC$3:$AC$9,0),1)","v":24}]
[null,2,"Keg Coors Light","Draft beer",65,"12/ case of twelve (e.g. 12 bottles of wine or beer)",null,null,null,null,null,null,null,null,null,null,null,null,null,null,null,null,null,null,null,null,"Bottle/ can beer",4,"4/ case of four (e.g. case of 4 boxes of wine)",null,null,{"$f":"INDEX($AB$3:$AB$9,MATCH(F4,$AC$3:$AC$9,0),1)","v":12}]
[null,3,"Well Vodka","Liquor",6,"1 / single item (e.g. single keg or bottle)",null,null,null,null,null,null,null,null,null,null,null,null,null,null,null,null,null,null,null,null,"Liquor",6,"6 / case of six (e.g. 6 cans, 6 bottle case of wine)",null,null,1]
[null,4,"House White","Wine",60,"12/ case of twelve (e.g. 12 bottles of wine or beer)",null,null,null,null,null,null,null,null,null,null,null,null,null,null,null,null,null,null,null,null,"Wine",12,"12/ case of twelve (e.g. 12 bottles of wine or beer)",null,null,12]
[null,5,"Mixer","Misc",10,"1 / single item (e.g. single keg or bottle)",null,null,null,null,null,null,null,null,null,null,null,null,null,null,null,null,null,null,null,null,"Misc",24,"24/ case of twenty four (e.g. 24 pack of cans)",null,null,1]
[null,6,null,null,null,null,null,null,null,null,null,null,null,null,null,null,null,null,null,null,null,null,null,null,null,null,null,30,"30/ case of thirty (e.g. 30 pack of cans)",null,null,{"$error":"#N/A"}]
[null,7,null,null,null,null,null,null,null,null,null,null,null,null,null,null,null,null,null,null,null,null,null,null,null,null,null,1,"Other (enter price of single vessel or unit)",null,null,{"$error":"#N/A"}]
[null,8,null,null,null,null,null,null,null,null,null,null,null,null,null,null,null,null,null,null,null,null,null,null,null,null,null,null,null,null,null,{"$error":"#N/A"}]
[null,9,null,null,null,null,null,null,null,null,null,null,null,null,null,null,null,null,null,null,null,null,null,null,null,null,null,null,null,null,null,{"$error":"#N/A"}]
[null,10,null,null,null,null,null,null,null,null,null,null,null,null,null,null,null,null,null,null,null,null,null,null,null,null,null,null,null,null,null,{"$error":"#N/A"}]
[null,11,null,null,null,null,null,null,null,null,null,null,null,null,null,null,null,null,null,null,null,null,null,null,null,null,null,null,null,null,null,{"$error":"#N/A"}]
[null,12,null,null,null,null,null,null,null,null,null,null,null,null,null,null,null,null,null,null,null,null,null,null,null,null,null,null,null,null,null,{"$error":"#N/A"}]
[null,13,null,null,null,null,null,null,null,null,null,null,null,null,null,null,null,null,null,null,null,null,null,null,null,null,null,null,null,null,null,{"$error":"#N/A"}]
[null,14,null,null,null,null,null,null,null,null,null,null,null,null,null,null,null,null,null,null,null,null,null,null,null,null,null,null,null,null,null,{"$error":"#N/A"}]
[null,15,null,null,null,null,null,null,null,null,null,null,null,null,null,null,null,null,null,null,null,null,null,null,null,null,null,null,null,null,null,{"$error":"#N/A"}]
[null,16,null,null,null,null,null,null,null,null,null,null,null,null,null,null,null,null,null,null,null,null,null,null,null,null,null,null,null,null,null,{"$error":"#N/A"}]
[null,17,null,null,null,null,null,null,null,null,null,null,null,null,null,null,null,null,null,null,null,null,null,null,null,null,null,null,null,null,null,{"$error":"#N/A"}]
[null,18,null,null,null,null,null,null,null,null,null,null,null,null,null,null,null,null,null,null,null,null,null,null,null,null,null,null,null,null,null,{"$error":"#N/A"}]
[null,19,null,null,null,null,null,null,null,null,null,null,null,null,null,null,null,null,null,null,null,null,null,null,null,null,null,null,null,null,null,{"$error":"#N/A"}]
[null,20,null,null,null,null,null,null,null,null,null,null,null,null,null,null,null,null,null,null,null,null,null,null,null,null,null,null,null,null,null,{"$error":"#N/A"}]
[null,21,null,null,null,null,null,null,null,null,null,null,null,null,null,null,null,null,null,null,null,null,null,null,null,null,null,null,null,null,null,{"$error":"#N/A"}]
[null,22,null,null,null,null,null,null,null,null,null,null,null,null,null,null,null,null,null,null,null,null,null,null,null,null,null,null,null,null,null,{"$error":"#N/A"}]
[null,23,null,null,null,null,null,null,null,null,null,null,null,null,null,null,null,null,null,null,null,null,null,null,null,null,null,null,null,null,null,{"$error":"#N/A"}]
[null,24,null,null,null,null,null,null,null,null,null,null,null,null,null,null,null,null,null,null,null,null,null,null,null,null,null,null,null,null,null,{"$error":"#N/A"}]
[null,25,null,null,null,null,null,null,null,null,null,null,null,null,null,null,null,null,null,null,null,null,null,null,null,null,null,null,null,null,null,{"$error":"#N/A"}]
[null,26,null,null,null,null,null,null,null,null,null,null,null,null,null,null,null,null,null,null,null,null,null,null,null,null,null,null,null,null,null,{"$error":"#N/A"}]
[null,27,null,null,null,null,null,null,null,null,null,null,null,null,null,null,null,null,null,null,null,null,null,null,null,null,null,null,null,null,null,{"$error":"#N/A"}]
[null,28,null,null,null,null,null,null,null,null,null,null,null,null,null,null,null,null,null,null,null,null,null,null,null,null,null,null,null,null,null,{"$error":"#N/A"}]
{"$rows_left_out":473}
{"sheet":"Count","index":3,"n_rows":502,"n_cols":16,"rows_kept":502,"cut":false,"hidden":false,"merged":[]}
[null,null,null,null,"Zone 1","Zone 2","Zone 3","Zone 4","Zone 5","Zone 6","Zone 7","Zone 8","Zone 9","Zone 10","Total","Value"]
[null,null,null,null,"e.g. Well 1","e.g. Well 2","e.g. Bar cooler","e.g. Bar liquor pyramid","e.g. Bar Liquor","e.g.Liquor backups","e.g. Dry storage","e.g. Liquor store","e.g. Walk in cooler","e.g. Wine room",{"$f":"SUM(O3:O502)","v":0},{"$f":"SUM(P3:P502)","v":0}]
[null,1,{"$f":"IF(ISBLANK('Product info'!C3),\"\",'Product info'!C3)","v":"Bottle Bud"},{"$f":"IF(ISBLANK('Product info'!D3),\"\",'Product info'!D3)","v":"Bottle/ can beer"},null,null,null,null,null,null,null,null,null,null,{"$f":"SUM(E3:N3)","v":0},{"$f":"IF(ISERROR(O3*'Product info'!E3/'Product info'!AF3),0,O3*'Product info'!E3/'Product info'!AF3)","v":0}]
[null,2,{"$f":"IF(ISBLANK('Product info'!C4),\"\",'Product info'!C4)","v":"Keg Coors Light"},{"$f":"IF(ISBLANK('Product info'!D4),\"\",'Product info'!D4)","v":"Draft beer"},null,null,null,null,null,null,null,null,null,null,{"$f":"SUM(E4:N4)","v":0},{"$f":"IF(ISERROR(O4*'Product info'!E4/'Product info'!AF4),0,O4*'Product info'!E4/'Product info'!AF4)","v":0}]
[null,3,{"$f":"IF(ISBLANK('Product info'!C5),\"\",'Product info'!C5)","v":"Well Vodka"},{"$f":"IF(ISBLANK('Product info'!D5),\"\",'Product info'!D5)","v":"Liquor"},null,null,null,null,null,null,null,null,null,null,0,{"$f":"IF(ISERROR(O5*'Product info'!E5/'Product info'!AF5),0,O5*'Product info'!E5/'Product info'!AF5)","v":0}]
[null,4,{"$f":"IF(ISBLANK('Product info'!C6),\"\",'Product info'!C6)","v":"House White"},{"$f":"IF(ISBLANK('Product info'!D6),\"\",'Product info'!D6)","v":"Wine"},null,null,null,null,null,null,null,null,null,null,0,{"$f":"IF(ISERROR(O6*'Product info'!E6/'Product info'!AF6),0,O6*'Product info'!E6/'Product info'!AF6)","v":0}]
[null,5,{"$f":"IF(ISBLANK('Product info'!C7),\"\",'Product info'!C7)","v":"Mixer"},{"$f":"IF(ISBLANK('Product info'!D7),\"\",'Product info'!D7)","v":"Misc"},null,null,null,null,null,null,null,null,null,null,0,{"$f":"IF(ISERROR(O7*'Product info'!E7/'Product info'!AF7),0,O7*'Product info'!E7/'Product info'!AF7)","v":0}]
[null,6,{"$f":"IF(ISBLANK('Product info'!C8),\"\",'Product info'!C8)","v":""},{"$f":"IF(ISBLANK('Product info'!D8),\"\",'Product info'!D8)","v":""},null,null,null,null,null,null,null,null,null,null,0,{"$f":"IF(ISERROR(O8*'Product info'!E8/'Product info'!AF8),0,O8*'Product info'!E8/'Product info'!AF8)","v":0}]
[null,7,{"$f":"IF(ISBLANK('Product info'!C9),\"\",'Product info'!C9)","v":""},{"$f":"IF(ISBLANK('Product info'!D9),\"\",'Product info'!D9)","v":""},null,null,null,null,null,null,null,null,null,null,0,{"$f":"IF(ISERROR(O9*'Product info'!E9/'Product info'!AF9),0,O9*'Product info'!E9/'Product info'!AF9)","v":0}]
[null,8,{"$f":"IF(ISBLANK('Product info'!C10),\"\",'Product info'!C10)","v":""},{"$f":"IF(ISBLANK('Product info'!D10),\"\",'Product info'!D10)","v":""},null,null,null,null,null,null,null,null,null,null,0,{"$f":"IF(ISERROR(O10*'Product info'!E10/'Product info'!AF10),0,O10*'Product info'!E10/'Product info'!AF10)","v":0}]
[null,9,{"$f":"IF(ISBLANK('Product info'!C11),\"\",'Product info'!C11)","v":""},{"$f":"IF(ISBLANK('Product info'!D11),\"\",'Product info'!D11)","v":""},null,null,null,null,null,null,null,null,null,null,0,{"$f":"IF(ISERROR(O11*'Product info'!E11/'Product info'!AF11),0,O11*'Product info'!E11/'Product info'!AF11)","v":0}]
[null,10,{"$f":"IF(ISBLANK('Product info'!C12),\"\",'Product info'!C12)","v":""},{"$f":"IF(ISBLANK('Product info'!D12),\"\",'Product info'!D12)","v":""},null,null,null,null,null,null,null,null,null,null,0,{"$f":"IF(ISERROR(O12*'Product info'!E12/'Product info'!AF12),0,O12*'Product info'!E12/'Product info'!AF12)","v":0}]
[null,11,{"$f":"IF(ISBLANK('Product info'!C13),\"\",'Product info'!C13)","v":""},{"$f":"IF(ISBLANK('Product info'!D13),\"\",'Product info'!D13)","v":""},null,null,null,null,null,null,null,null,null,null,{"$f":"SUM(E13:N13)","v":0},{"$f":"IF(ISERROR(O13*'Product info'!E13/'Product info'!AF13),0,O13*'Product info'!E13/'Product info'!AF13)","v":0}]
[null,12,{"$f":"IF(ISBLANK('Product info'!C14),\"\",'Product info'!C14)","v":""},{"$f":"IF(ISBLANK('Product info'!D14),\"\",'Product info'!D14)","v":""},null,null,null,null,null,null,null,null,null,null,0,{"$f":"IF(ISERROR(O14*'Product info'!E14/'Product info'!AF14),0,O14*'Product info'!E14/'Product info'!AF14)","v":0}]
[null,13,{"$f":"IF(ISBLANK('Product info'!C15),\"\",'Product info'!C15)","v":""},{"$f":"IF(ISBLANK('Product info'!D15),\"\",'Product info'!D15)","v":""},null,null,null,null,null,null,null,null,null,null,0,{"$f":"IF(ISERROR(O15*'Product info'!E15/'Product info'!AF15),0,O15*'Product info'!E15/'Product info'!AF15)","v":0}]
[null,14,{"$f":"IF(ISBLANK('Product info'!C16),\"\",'Product info'!C16)","v":""},{"$f":"IF(ISBLANK('Product info'!D16),\"\",'Product info'!D16)","v":""},null,null,null,null,null,null,null,null,null,null,0,{"$f":"IF(ISERROR(O16*'Product info'!E16/'Product info'!AF16),0,O16*'Product info'!E16/'Product info'!AF16)","v":0}]
[null,15,{"$f":"IF(ISBLANK('Product info'!C17),\"\",'Product info'!C17)","v":""},{"$f":"IF(ISBLANK('Product info'!D17),\"\",'Product info'!D17)","v":""},null,null,null,null,null,null,null,null,null,null,0,{"$f":"IF(ISERROR(O17*'Product info'!E17/'Product info'!AF17),0,O17*'Product info'!E17/'Product info'!AF17)","v":0}]
[null,16,{"$f":"IF(ISBLANK('Product info'!C18),\"\",'Product info'!C18)","v":""},{"$f":"IF(ISBLANK('Product info'!D18),\"\",'Product info'!D18)","v":""},null,null,null,null,null,null,null,null,null,null,0,{"$f":"IF(ISERROR(O18*'Product info'!E18/'Product info'!AF18),0,O18*'Product info'!E18/'Product info'!AF18)","v":0}]
[null,17,{"$f":"IF(ISBLANK('Product info'!C19),\"\",'Product info'!C19)","v":""},{"$f":"IF(ISBLANK('Product info'!D19),\"\",'Product info'!D19)","v":""},null,null,null,null,null,null,null,null,null,null,0,{"$f":"IF(ISERROR(O19*'Product info'!E19/'Product info'!AF19),0,O19*'Product info'!E19/'Product info'!AF19)","v":0}]
[null,18,{"$f":"IF(ISBLANK('Product info'!C20),\"\",'Product info'!C20)","v":""},{"$f":"IF(ISBLANK('Product info'!D20),\"\",'Product info'!D20)","v":""},null,null,null,null,null,null,null,null,null,null,0,{"$f":"IF(ISERROR(O20*'Product info'!E20/'Product info'!AF20),0,O20*'Product info'!E20/'Product info'!AF20)","v":0}]
[null,19,{"$f":"IF(ISBLANK('Product info'!C21),\"\",'Product info'!C21)","v":""},{"$f":"IF(ISBLANK('Product info'!D21),\"\",'Product info'!D21)","v":""},null,null,null,null,null,null,null,null,null,null,0,{"$f":"IF(ISERROR(O21*'Product info'!E21/'Product info'!AF21),0,O21*'Product info'!E21/'Product info'!AF21)","v":0}]
[null,20,{"$f":"IF(ISBLANK('Product info'!C22),\"\",'Product info'!C22)","v":""},{"$f":"IF(ISBLANK('Product info'!D22),\"\",'Product info'!D22)","v":""},null,null,null,null,null,null,null,null,null,null,0,{"$f":"IF(ISERROR(O22*'Product info'!E22/'Product info'!AF22),0,O22*'Product info'!E22/'Product info'!AF22)","v":0}]
[null,21,{"$f":"IF(ISBLANK('Product info'!C23),\"\",'Product info'!C23)","v":""},{"$f":"IF(ISBLANK('Product info'!D23),\"\",'Product info'!D23)","v":""},null,null,null,null,null,null,null,null,null,null,0,{"$f":"IF(ISERROR(O23*'Product info'!E23/'Product info'!AF23),0,O23*'Product info'!E23/'Product info'!AF23)","v":0}]
[null,22,{"$f":"IF(ISBLANK('Product info'!C24),\"\",'Product info'!C24)","v":""},{"$f":"IF(ISBLANK('Product info'!D24),\"\",'Product info'!D24)","v":""},null,null,null,null,null,null,null,null,null,null,0,{"$f":"IF(ISERROR(O24*'Product info'!E24/'Product info'!AF24),0,O24*'Product info'!E24/'Product info'!AF24)","v":0}]
[null,23,{"$f":"IF(ISBLANK('Product info'!C25),\"\",'Product info'!C25)","v":""},{"$f":"IF(ISBLANK('Product info'!D25),\"\",'Product info'!D25)","v":""},null,null,null,null,null,null,null,null,null,null,0,{"$f":"IF(ISERROR(O25*'Product info'!E25/'Product info'!AF25),0,O25*'Product info'!E25/'Product info'!AF25)","v":0}]
[null,24,{"$f":"IF(ISBLANK('Product info'!C26),\"\",'Product info'!C26)","v":""},{"$f":"IF(ISBLANK('Product info'!D26),\"\",'Product info'!D26)","v":""},null,null,null,null,null,null,null,null,null,null,0,{"$f":"IF(ISERROR(O26*'Product info'!E26/'Product info'!AF26),0,O26*'Product info'!E26/'Product info'!AF26)","v":0}]
[null,25,{"$f":"IF(ISBLANK('Product info'!C27),\"\",'Product info'!C27)","v":""},{"$f":"IF(ISBLANK('Product info'!D27),\"\",'Product info'!D27)","v":""},null,null,null,null,null,null,null,null,null,null,0,{"$f":"IF(ISERROR(O27*'Product info'!E27/'Product info'!AF27),0,O27*'Product info'!E27/'Product info'!AF27)","v":0}]
[null,26,{"$f":"IF(ISBLANK('Product info'!C28),\"\",'Product info'!C28)","v":""},{"$f":"IF(ISBLANK('Product info'!D28),\"\",'Product info'!D28)","v":""},null,null,null,null,null,null,null,null,null,null,0,{"$f":"IF(ISERROR(O28*'Product info'!E28/'Product info'!AF28),0,O28*'Product info'!E28/'Product info'!AF28)","v":0}]
[null,27,{"$f":"IF(ISBLANK('Product info'!C29),\"\",'Product info'!C29)","v":""},{"$f":"IF(ISBLANK('Product info'!D29),\"\",'Product info'!D29)","v":""},null,null,null,null,null,null,null,null,null,null,0,{"$f":"IF(ISERROR(O29*'Product info'!E29/'Product info'!AF29),0,O29*'Product info'!E29/'Product info'!AF29)","v":0}]
[null,28,{"$f":"IF(ISBLANK('Product info'!C30),\"\",'Product info'!C30)","v":""},{"$f":"IF(ISBLANK('Product info'!D30),\"\",'Product info'!D30)","v":""},null,null,null,null,null,null,null,null,null,null,0,{"$f":"IF(ISERROR(O30*'Product info'!E30/'Product info'!AF30),0,O30*'Product info'!E30/'Product info'!AF30)","v":0}]
{"$rows_left_out":473}
{"sheet":"Deliveries and sales","index":4,"n_rows":8,"n_cols":4,"rows_kept":8,"cut":false,"hidden":false,"merged":[]}
[null,null,null,"www.bar-i.com"]
[null,"Category","Deliveries for period ($)","Sales for period ($)"]
[null,"Draft beer"]
[null,"Bottle/ can beer"]
[null,"Liquor"]
[null,"Wine"]
[null,"Misc"]
[null,"Total",{"$f":"SUM(C3:C7)","v":0},{"$f":"SUM(D3:D7)","v":0}]

{"sheet":"Liquor Cost","index":5,"n_rows":8,"n_cols":8,"rows_kept":8,"cut":false,"hidden":false,"merged":[]}
[null,null,null,null,null,null,null,"www.bar-i.com"]
[null,"Category","Starting value ($)","Ending value ($)","Delivered ($)","Usage ($)","Sales ($)","2013-10-01"]
[null,"Draft beer",{"$f":"SUMPRODUCT(('Previous Count'!$D$3:$D$502='Liquor Cost'!B3)*'Previous Count'!$P$3:$P$502)","v":0},{"$f":"SUMPRODUCT((Count!$D$3:$D$502='Liquor Cost'!B3)*Count!$P$3:$P$502)","v":0},{"$f":"'Deliveries and sales'!C3","v":0},{"$f":"C3-D3+E3","v":0},{"$f":"'Deliveries and sales'!D3","v":0},{"$f":"IF(ISERROR(F3/G3),0,F3/G3)","v":0}]
[null,"Bottle/ can beer",{"$f":"SUMPRODUCT(('Previous Count'!$D$3:$D$502='Liquor Cost'!B4)*'Previous Count'!$P$3:$P$502)","v":0},{"$f":"SUMPRODUCT((Count!$D$3:$D$502='Liquor Cost'!B4)*Count!$P$3:$P$502)","v":0},{"$f":"'Deliveries and sales'!C4","v":0},{"$f":"C4-D4+E4","v":0},{"$f":"'Deliveries and sales'!D4","v":0},{"$f":"IF(ISERROR(F4/G4),0,F4/G4)","v":0}]
[null,"Liquor",{"$f":"SUMPRODUCT(('Previous Count'!$D$3:$D$502='Liquor Cost'!B5)*'Previous Count'!$P$3:$P$502)","v":0},{"$f":"SUMPRODUCT((Count!$D$3:$D$502='Liquor Cost'!B5)*Count!$P$3:$P$502)","v":0},{"$f":"'Deliveries and sales'!C5","v":0},0,{"$f":"'Deliveries and sales'!D5","v":0},0]
[null,"Wine",{"$f":"SUMPRODUCT(('Previous Count'!$D$3:$D$502='Liquor Cost'!B6)*'Previous Count'!$P$3:$P$502)","v":0},{"$f":"SUMPRODUCT((Count!$D$3:$D$502='Liquor Cost'!B6)*Count!$P$3:$P$502)","v":0},{"$f":"'Deliveries and sales'!C6","v":0},0,{"$f":"'Deliveries and sales'!D6","v":0},0]
[null,"Misc",{"$f":"SUMPRODUCT(('Previous Count'!$D$3:$D$502='Liquor Cost'!B7)*'Previous Count'!$P$3:$P$502)","v":0},{"$f":"SUMPRODUCT((Count!$D$3:$D$502='Liquor Cost'!B7)*Count!$P$3:$P$502)","v":0},{"$f":"'Deliveries and sales'!C7","v":0},0,{"$f":"'Deliveries and sales'!D7","v":0},0]
[null,"Total",{"$f":"SUM(C3:C7)","v":0},{"$f":"SUM(D3:D7)","v":0},0,0,0,0]

{"sheet":"Liquor cost trend","index":6,"n_rows":19,"n_cols":55,"rows_kept":19,"cut":false,"hidden":false,"merged":[]}
[]
[]
[]
[]
[]
[]
[]
[]
[]
[]
[]
[]
[null,"Category","2013-09-01",null,null,null,null,null,null,null,null,null,null,null,null,null,null,null,null,null,null,null,null,null,null,null,null,null,null,null,null,null,null,null,null,null,null,null,null,null,null,null,null,null,null,null,null,null,null,null,null,null,null,null,"YTD average"]
[null,"Draft beer",0,null,null,null,null,null,null,null,null,null,null,null,null,null,null,null,null,null,null,null,null,null,null,null,null,null,null,null,null,null,null,null,null,null,null,null,null,null,null,null,null,null,null,null,null,null,null,null,null,null,null,null,{"$f":"AVERAGE(C14:BB14)","v":0}]
[null,"Bottle/ can beer",0,null,null,null,null,null,null,null,null,null,null,null,null,null,null,null,null,null,null,null,null,null,null,null,null,null,null,null,null,null,null,null,null,null,null,null,null,null,null,null,null,null,null,null,null,null,null,null,null,null,null,null,{"$f":"AVERAGE(C15:BB15)","v":0}]
[null,"Liquor",0,null,null,null,null,null,null,null,null,null,null,null,null,null,null,null,null,null,null,null,null,null,null,null,null,null,null,null,null,null,null,null,null,null,null,null,null,null,null,null,null,null,null,null,null,null,null,null,null,null,null,null,0]
[null,"Wine",0,null,null,null,null,null,null,null,null,null,null,null,null,null,null,null,null,null,null,null,null,null,null,null,null,null,null,null,null,null,null,null,null,null,null,null,null,null,null,null,null,null,null,null,null,null,null,null,null,null,null,null,0]
[null,"Misc",0,null,null,null,null,null,null,null,null,null,null,null,null,null,null,null,null,null,null,null,null,null,null,null,null,null,null,null,null,null,null,null,null,null,null,null,null,null,null,null,null,null,null,null,null,null,null,null,null,null,null,null,0]
[null,"Total",0,null,null,null,null,null,null,null,null,null,null,null,null,null,null,null,null,null,null,null,null,null,null,null,null,null,null,null,null,null,null,null,null,null,null,null,null,null,null,null,null,null,null,null,null,null,null,null,null,null,null,null,0]